Actinothermal index
type: Property
type: Concept
created: 2022-02-07T17:00:00
modified: 2022-03-10T14:33:17
broader: Property
definition: An index of the capability of radiation or light to produce a photochemical reaction, as in photography or in the fading of coloured pigments (https://glosbe.com/).
in scheme: ozcar-theia

Property
type: Concept
narrower: Actinothermal index