Holmium
type: Entity
type: Concept
created: 2022-02-07T17:00:00
alternative label: Ho
broader: Chemical entity
definition: [Wikipedia] Holmium is a chemical element with the symbol Ho and atomic number 67. Part of the lanthanide series, holmium is a rare-earth element.
in scheme: ozcar-theia

Chemical entity
type: Concept
narrower: Holmium