Lanthanum
type: Entity
type: Concept
created: 2022-02-07T17:00:00
alternative label: La
broader: Chemical entity
definition: [Wikipedia] Lanthanum is a chemical element with the symbol La and atomic number 57. It is a soft, ductile, silvery-white metal that tarnishes slowly when exposed to air. It is the eponym of the lanthanide series, a group of 15 similar elements between lanthanum and lutetium in the periodic table, of which lanthanum is the first and the prototype. Lanthanum is traditionally counted among the rare earth elements. The usual oxidation state is +3. Lanthanum has no biological role in humans but is essential to some bacteria. It is not particularly toxic to humans but does show some antimicrobial activity.
in scheme: ozcar-theia

Chemical entity
type: Concept
narrower: Lanthanum