Major ions
type: Entity
type: Concept
narrower: Sulfate

Sulfate
type: Entity
type: Concept
created: 2022-02-07T17:00:00
broader: Major ions
broader: Chemical entity
definition: [Wikipedia] The sulfate or sulphate ion is a polyatomic anion with the empirical formula SO2−4. Salts, acid derivatives, and peroxides of sulfate are widely used in industry. Sulfates occur widely in everyday life. Sulfates are salts of sulfuric acid and many are prepared from that acid.
definition: [ChEBI] A sulfur oxoanion obtained by deprotonation of both OH groups of sulfuric acid.
in scheme: ozcar-theia

Chemical entity
type: Concept
narrower: Sulfate