Chloroform
type: Entity
type: Concept
created: 2022-02-07T17:00:00
modified: 2023-05-12T13:41:38
broader: Chemical entity
definition: [Wikipedia] Chloroform, or trichloromethane, is an organic compound with formula CHCl3. It is a colorless, strong-smelling, dense liquid that is produced on a large scale as a precursor to PTFE. It is also a precursor to various refrigerants. It is one of the four chloromethanes and a trihalomethane. It is a powerful anesthetic, euphoriant, anxiolytic and sedative when inhaled or ingested.
definition: [ChEBI] A one-carbon compound that is methane in which three of the hydrogens are replaced by chlorines.
in scheme: ozcar-theia

Chemical entity
type: Concept
narrower: Chloroform