Major ions
type: Entity
type: Concept
narrower: Calcium(2+)

Calcium(2+)
type: Entity
type: Concept
created: 2022-02-07T17:00:00
modified: 2023-05-12T13:55:23
broad match: http://vocabs.lter-europe.net/EnvThes/20804
broad match: http://www.eionet.europa.eu/gemet/concept/1111
broader: Major ions
broader: Chemical entity
definition: Calcium(2+) is a calcium cation, a divalent metal cation and a monoatomic dication. It has a role as a human metabolite and a cofactor.
in scheme: ozcar-theia

Chemical entity
type: Concept
narrower: Calcium(2+)

Calcium(2+) is a calcium cation, a divalent metal cation and a monoatomic dication. It has a role as a human metabolite and a cofactor.
source: Calcium-ion