Average
type: Concept
narrower: Spatial mean

Spatial mean
type: StatisticalMeasure
type: Concept
created: 2022-06-01T08:12:49
modified: 2022-06-01T08:17:35
broader: Average
definition: The temporal mean is the arithmetic mean of a series of values located within a space.
in scheme: ozcar-theia