Phosphate
type: Concept
type: Entity
created: 2022-02-07T17:00:00
modified: 2023-05-12T13:39:59
broader: Chemical entity
definition: [ChEBI] A phosphate ion that is the conjugate base of hydrogenphosphate.
in scheme: ozcar-theia

Chemical entity
type: Concept
narrower: Phosphate