Sap
type: Entity
type: Concept
related: Sap flow

Vegetation phenomenon
type: Concept
narrower: Sap flow

Sap flow
type: Entity
type: Concept
created: 2022-02-07T17:00:00
broader: Vegetation phenomenon
definition: [edaphic scientific] Sap flow is the movement of fluid in the roots, stems and branches of plants. Sap flow is typically measured in the xylem of plants. More specifically, sap flow is measured in the sapwood portion of xylem, or the conducting wood, which differs to the other portion of xylem known as heartwood.
in scheme: ozcar-theia
related: Sap