Electromagnetic radiation
type: Entity
type: Concept

Shortwave radiation
type: Constraint
type: Concept
created: 2022-02-07T17:00:00
broader: Radiation transfer constraint
definition: [Wikipedia] Shortwave radiation (SW) is radiant energy with wavelengths in the visible (VIS), near-ultraviolet (UV), and near-infrared (NIR) spectra.
in scheme: ozcar-theia
constrains: Electromagnetic radiation

Radiation transfer constraint
type: Concept
narrower: Shortwave radiation