Ioxynil octanoate
type: Entity
type: Concept
modified: 2023-05-12T15:00:37
broader: Chemical entity
definition: Ioxynil octanoate is a benzoate ester and a member of phenols.
in scheme: ozcar-theia

Chemical entity
type: Concept
narrower: Ioxynil octanoate

Ioxynil octanoate is a benzoate ester and a member of phenols.
source: https://www.ebi.ac.uk/chebi/searchId.do