Nitrous oxide
type: Entity
type: Concept
created: 2022-02-07T17:00:00
broader: Chemical entity
definition: [Wikipedia] Nitrous oxide, commonly known as laughing gas or nitrous, is a chemical compound, an oxide of nitrogen with the formula N2O. At room temperature, it is a colourless non-flammable gas, with a slight metallic scent and taste. At elevated temperatures, nitrous oxide is a powerful oxidiser similar to molecular oxygen.
in scheme: ozcar-theia
related match: http://vocabs.lter-europe.net/EnvThes/21193

Chemical entity
type: Concept
narrower: Nitrous oxide