Flumioxazin
type: Entity
type: Concept
created: 2022-02-07T17:00:00
broader: Chemical entity
definition: [ChEBI] A benzoxazine that is N-(prop-2-yn-1-yl)-2H-1,4-benzoxazin-3(4H)-one which is substituted at position 6 by a 1,3-dioxo-1,3,4,5,6,7-hexahydro-2H-isoindol-2-yl group and at position 7 by a fluorine. A protoporphyrinogen oxidase inhibitor, it is used for the control of weeds in soya, peanuts, and a variety of vegetable and fruit crops.
in scheme: ozcar-theia

Chemical entity
type: Concept
narrower: Flumioxazin