Spring
type: Entity
type: Concept
created: 2022-02-07T17:00:00
broader: Surface water
definition: [Wikipedia] A spring is a point at which water flows from an aquifer to the Earth's surface.
in scheme: ozcar-theia

Surface water
type: Entity
type: Concept
narrower: Spring