Chlorotrifluoromethane
type: Concept
type: Entity
created: 2022-02-07T17:00:00
alternative label: CFC-13
alternative label: Freon-13
alternative label: R-13
broad match: http://www.eionet.europa.eu/gemet/concept/3483
broader: Chemical entity
definition: [Wikipedia] Chlorotrifluoromethane, R-13, CFC-13, or Freon 13, is a non-flammable, non-corrosive chlorofluorocarbon (CFC) and also a mixed halomethane. It is a man-made substance used primarily as a refrigerant. When released into the environment, CFC-13 has a high ozone depletion potential, high global warming potential, and long atmospheric lifetime.
in scheme: ozcar-theia

Chemical entity
type: Concept
narrower: Chlorotrifluoromethane