Penconazole
type: Entity
type: Concept
broader: Chemical entity
definition: A racemate comprising equal amounts of (R)- and (S)-penconazole. A fungicide used to control powdery mildew, scab and other pathogenic Ascomycetes, Basidiomycetes and Deuteromycetes.
in scheme: ozcar-theia

Chemical entity
type: Concept
narrower: Penconazole

A racemate comprising equal amounts of (R)- and (S)-penconazole. A fungicide used to control powdery mildew, scab and other pathogenic Ascomycetes, Basidiomycetes and Deuteromycetes.
source: https://www.ebi.ac.uk/chebi/searchId.do