Snow
type: Concept
type: Entity
created: 2022-02-07T17:00:00
broader: Cryosphere
definition: [Wikipedia] Snow comprises individual ice crystals that grow while suspended in the atmosphere—usually within clouds—and then fall, accumulating on the ground where they undergo further changes. It consists of frozen crystalline water throughout its life cycle, starting when, under suitable conditions, the ice crystals form in the atmosphere, increase to millimeter size, precipitate and accumulate on surfaces, then metamorphose in place, and ultimately melt, slide or sublimate away.
in scheme: ozcar-theia
narrower: Snow cover

Snow cover
type: Entity
type: Concept
broader: Snow

Cryosphere
type: Entity
type: Concept
narrower: Snow