River bed
type: Entity
type: Concept
created: 2022-02-07T17:00:00
broader: Topography
definition: [Wikipedia] The path where a river runs, or where a river once ran; the bottom earthen part of a river, not including the riverbanks.
in scheme: ozcar-theia

Topography
type: Entity
type: Concept
narrower: River bed