Diffuse radiation
type: Constraint
type: Concept
created: 2022-02-07T17:00:00
broader: Radiation transfer constraint
definition: Diffuse radiation is radiation reaching a surface after having been scattered from the direct beam
in scheme: ozcar-theia
constrains: Electromagnetic radiation

Electromagnetic radiation
type: Entity
type: Concept

Radiation transfer constraint
type: Concept
narrower: Diffuse radiation