Butralin
type: Entity
type: Concept
created: 2022-02-07T17:00:00
modified: 2023-05-12T13:52:41
broader: Chemical entity
definition: Butralin is an active substance of plant protection product (or phytopharmaceutical product, or pesticide), which has a herbicidal effect, and belongs to the chemical family of toluidines
in scheme: ozcar-theia

Chemical entity
type: Concept
narrower: Butralin

Butralin is an active substance of plant protection product (or phytopharmaceutical product, or pesticide), which has a herbicidal effect, and belongs to the chemical family of toluidines
source: Butraline