Nitrogen-15
type: Entity
type: Concept
created: 2022-02-07T17:00:00
modified: 2023-05-12T13:26:14
broad match: http://vocabs.lter-europe.net/EnvThes/20832
broad match: http://www.eionet.europa.eu/gemet/concept/5605
broader: Nitrogen
definition: [ChEBI] The stable isotope of nitrogen with relative atomic mass 15.000109. The least abundant (0.368 atom percent) isotope of naturally occurring nitrogen.
in scheme: ozcar-theia

Nitrogen
type: Entity
type: Concept
narrower: Nitrogen-15